Glider In The Agulhas
type: Concept
description: Glider program operated by CSIR in South Africa along the Agulhas current
notation: GINA

ARGO AUSTRALIA
type: Concept
description: ARGO AUSTRALIA
notation: argoAustralia

MEDARGO
type: Concept
description: NA
notation: MEDARGO

GLOSS AO
type: Concept
description: Global Sea Level Observing System Tide Gauges - Angola
notation: GLOSSAO

CSI-MB
type: Concept
description: Owned and maintained by UNC Coastal Studies Institute, Data provided by Scripps Institution of Oceanography
notation: CSIMB

LALINET
type: Concept
description: LALINET Latin America Lidar Network
notation: LALINET

IABP NIC
type: Concept
description: NA
notation: IABPNIC

GLOSS SE
type: Concept
description: Global Sea Level Observing System Tide Gauges - Sweden
notation: GLOSSSE

Euro-Argo RISE
type: Concept
description: Euro-Argo Research Infrastructure Sustainability and Enhancement project
notation: EuroARGORISE

ARGO NORWAY
type: Concept
description: ARGO NORWAY
notation: argoNorway

E-AIMS
type: Concept
description: Euro-Argo Improvements for the GMES Marine Service
notation: eAIMS

GLOSS CI
type: Concept
description: Global Sea Level Observing System Tide Gauges - Côte d'Ivoire
notation: GLOSSCI

ASAP-ZA
type: Concept
description: South African ASAP program
notation: ASAPZA

OS-SNU
type: Concept
description: NA
notation: OSSNU

WHYCOS
type: Concept
description: World Hydrological Cycle Observing System
notation: WHYCOS

INDIA NIO
type: Concept
description: Collection of METOCEAN data in India Ocean
notation: INDIANIO

Navoceano DBCP
type: Concept
description: Naval Oceanographic Office DBCP programme
notation: NAVOCEANODBCP

CTBTO
type: Concept
description: Comprehensive Nuclear-Test Ban Treaty Organization International Monitoring System Network monitoring station
notation: CTBTO

GLOSS MA
type: Concept
description: Global Sea Level Observing System Tide Gauges - Morocco
notation: GLOSSMA

KIOST glider program
type: Concept
description: Glider program operated by KIOST. Storm tracking applications.
notation: KIOSTGlider

GLOSS EC
type: Concept
description: Global Sea Level Observing System Tide Gauges - Ecuador
notation: GLOSSEC

ARGO MEXICO
type: Concept
description: ARGO MEXICO
notation: argoMexico

OS-BCCR
type: Concept
description: NA
notation: OSBCCR

USM Glider Program
type: Concept
description: USM Glider Program is part of the Gulf of Mexico Coastal Ocean Observing System (GCOOS) is the Gulf of Mexico regional component of the U.S. Integrated Ocean Observing System (IOOS).
notation: USMGlider

ARGO GABON
type: Concept
description: ARGO GABON
notation: argoGabon

CORIOLIS-EGEE
type: Concept
description: NA
notation: coriolisEGEE

GLOSS NZ
type: Concept
description: Global Sea Level Observing System Tide Gauges - New Zealand
notation: GLOSSNZ

ESRLCCG
type: Concept
description: NOAA-ESRL (CCG)
notation: ESRLCCG

Memorial University of Newfoundland Glider program
type: Concept
description: Glider operation leaded by MUN
notation: MUNGlider

IAGOS
type: Concept
description: In-service Aircraft for a Global Observing System
notation: IAGOS

GEOMAR Glider program
type: Concept
description: Glider program operated by GEOMAR. Regular cooperation with Cape Verde Oceanographic institute.
notation: GEOMARGlider

GLOSS SV
type: Concept
description: Global Sea Level Observing System Tide Gauges - El Salvador
notation: GLOSSSV

JMA-TSU
type: Concept
description: JMA Tsunameter buoys
notation: JMATSU

GLOSS PT
type: Concept
description: Global Sea Level Observing System Tide Gauges - Portugal
notation: GLOSSPT

ARGO NEW ZEALAND
type: Concept
description: ARGO NEW ZEALAND
notation: argoNewZealand

SOOP-AOML-TSG
type: Concept
description: AOML managed TSG systems
notation: SOOPAOMLTSG

SOOP
type: Concept
description: Ship Of Opportunity Programme
notation: SOOP

VOS-GR
type: Concept
description: NA
notation: VOSGR

SOOP-FVP-Catching Data
type: Concept
description: Collection of T/S data from fishing equipment, developed by the Fishing Vessel Industry in Netherland
notation: SOOPFVPCatchingData

GLOSS JP
type: Concept
description: Global Sea Level Observing System Tide Gauges - Japan
notation: GLOSSJP

EUROARGO
type: Concept
description: European contribution to Argo program
notation: EUROARGO

Argo SIO .eq. (BGCSOLONOPP)
type: Concept
description: Side BioGeoChemical Argo program, National Oceanographic Partnership Program
notation: argoSIOeqBGCSOLONOPP

GLOSS BR
type: Concept
description: Global Sea Level Observing System Tide Gauges - Brasil
notation: GLOSSBR

VOS-IL
type: Concept
description: NA
notation: VOSIL

GLOSS GN
type: Concept
description: Global Sea Level Observing System Tide Gauges - Guinea
notation: GLOSSGN

GLOSS TH
type: Concept
description: Global Sea Level Observing System Tide Gauges - Thailand
notation: GLOSSTH

CORIOLIS-OVIDE
type: Concept
description: NA
notation: coriolisOvide

OS-MBARI
type: Concept
description: NA
notation: OSMBARI

UK-JERSEY MB
type: Concept
description: NA
notation: UKjerseyMB

Marine Institute Glider Program
type: Concept
description: Glider program operated by the Marine Institute (Ireland)
notation: MIGlider

KU DB
type: Concept
description: Drifting Buoys operated by Disaster Prevention Research Institute, Kyoto University (DPRI, KU)
notation: KUDB

E-SURFMAR-IRISH IMI
type: Concept
description: EUMETNET Composite Observing System (EUCOS)Surface Marine Programme and IRISH MARINE INSTITUTE (EUROPEAN CONTRIBUTION)
notation: eSurfmarIrishIMI

VOS-SRoCS
type: Concept
description: Science Research on Commercial Ships - Voluntary Observing Ships (VOS)
notation: VOSSRoCS

NorGliders - OVENS
type: Concept
description: OVENS glider program operated by UiB
notation: OVENSGlider

ARGO SIO EQ (ASIRI)
type: Concept
description: ARGO SIO EQ (ASIRI)
notation: argoSIOEqASIRI

NOAA-GML
type: Concept
description: NOAA Global Monitoring Laboratory
notation: NOAAGML

IABP
type: Concept
description: International Arctic Buoy Programme (IABP)
notation: IABP

NADP
type: Concept
description: National Atmospheric Deposition Program
notation: NADP

EANET
type: Concept
description: EANET
notation: EANET

University of Washington Applied Physics Laboratory Glider Program
type: Concept
description: Glider program supported by Integrative Observational Platforms Group, Applied Physics Laboratory, University of Washington
notation: UWAPLglider

ARGO EQ. OIST
type: Concept
description: ARGO EQ. OIST
notation: argoEqOIST

RBSN(ST)
type: Concept
description: Regional Basic Synoptic Network surface and upper-air station (SYNOP/TEMP)
notation: RBSNst

MERIDIAN GOODHOPE
type: Concept
description: NA
notation: meridianGoodHope

NCCOOS
type: Concept
description: NA
notation: NCCOOS

VOS-ES
type: Concept
description: NA
notation: VOSES

GLOSS CU
type: Concept
description: Global Sea Level Observing System Tide Gauges - Cuba
notation: GLOSSCU

Integrated Marine Observing System - Glider
type: Concept
description: The Ocean Gliders facility operates a fleet of autonomous underwater ocean gliders that undertake measurements from shelf and boundary currents in Australian waters.
notation: IMOSGlider

UK-MO MB
type: Concept
description: United Kingdom Met Office Moored Buoys
notation: UKMOMB

NAOS-Canada
type: Concept
description: Canadian contribution to NAOS program
notation: NAOSCanada

GLOSS MM
type: Concept
description: Global Sea Level Observing System Tide Gauges - Myanmar
notation: GLOSSMM

LOCEAN
type: Concept
description: Laboratory of Oceanography and Climate: Experiments and Digital Approaches
notation: LOCEAN

METEO FRANCE WB
type: Concept
description: Meteo-France waverider (operational)
notation: MeteoFranceWB

WRO
type: Concept
description: GOS Weather Radar
notation: WRO

VOS-DK
type: Concept
description: Danish VOS program
notation: VOSDK

GSRN
type: Concept
description: GCOS Surface Reference Network
notation: GSRN

EuroSea Argo
type: Concept
description: Argo part of the EuroSea project
notation: euroSeaArgo

ARGO BSH
type: Concept
description: ARGO BSH
notation: argoBSH

TG GM
type: Concept
description: Tide gauges in Gambia
notation: TGGM

JAMSTEC-MB
type: Concept
description: Japan Agency for Marine-Earth Science and Technology Moored Buoy
notation: JAMSTECMB

ARGO SRI LANKA
type: Concept
description: ARGO SRI LANKA
notation: argoSriLanka

Extended Ellett Array
type: Concept
description: The Ellett Array uses moorings, gliders and ship-based hydrography to observe the warm-water pathways of the AMOC, located in the Rockall Trough and the Hatton-Rockall Basin.
notation: EEAGlider

ARGO KIOST
type: Concept
description: ARGO KIOST
notation: argoKiost

OS-FSC
type: Concept
description: Program monitoring the Atlantic Inflow of the Shetland Branch. Faroe-Shetland Channel
notation: OSFSC

VOTO: Ocean Knowledge glider program
type: Concept
description: Ocean Knowledge at Voice of the Ocean glider program
notation: VOTOGlider

INDAAF
type: Concept
description: International Network to study Deposition and Atmospheric composition in Africa, https://indaaf.obs-mip.fr/
notation: INDAAF

COMPS-MB
type: Concept
description: Owned and maintained by COMPS (University of South Florida) Offshore Buoy
notation: COMPSMB

OS-SIO
type: Concept
description: NA
notation: OSSIO

ARGO JAMSTEC
type: Concept
description: ARGO JAMSTEC
notation: argoJamstec

TAO PIRATA US
type: Concept
description: NA
notation: taoPirataUS

BOM-TSU
type: Concept
description: Bureau of Meteorology (BOM) Tsunameter Buoy
notation: BOMTSU

ARGO WHOI
type: Concept
description: ARGO WHOI
notation: argoWHOI

GLOSS TT
type: Concept
description: Global Sea Level Observing System Tide Gauges - Trinidad and Tobago
notation: GLOSSTT

INDIA NIO-TSU
type: Concept
description: NIO Tsunameter buoys
notation: indiaNIOTSU

VOS-KR
type: Concept
description: NA
notation: VOSKR

ARGO WHOI EQ. IR
type: Concept
description: ARGO WHOI EQ. IR
notation: argoWHOIEqIR

GLOSS VN
type: Concept
description: Global Sea Level Observing System Tide Gauges - Vietnam
notation: GLOSSVN

ARGO INDIA
type: Concept
description: ARGO INDIA
notation: argoIndia

OS-MARUM
type: Concept
description: NA
notation: OSMARUM

ARGO EQ. TU
type: Concept
description: ARGO EQ. TU
notation: argoEqTU

Argo INDONESIA
type: Concept
description: Indonesian Argo program
notation: argoIndonesia

GLOSS FR
type: Concept
description: Global Sea Level Observing System Tide Gauges - France
notation: GLOSSFR

NDACC
type: Concept
description: Network for the Detection of Atmospheric Composition Change
notation: NDACC

ARGO POLAND
type: Concept
description: ARGO POLAND
notation: argoPoland

NDBC-BP
type: Concept
description: NA
notation: NDBCBP

CORMP-NC
type: Concept
description: Coastal Ocean Research and Monitoring Program -NC
notation: CORMPNC

CORIOLIS-PIRATA
type: Concept
description: NA
notation: coriolisPirata

ARGO KENYA
type: Concept
description: ARGO KENYA
notation: argoKenya

EUROSITES PLANIER
type: Concept
description: NA
notation: EurositesPlanier

PMEL MB
type: Concept
description: PMEL Moored Buoys
notation: PMELMB

EMEP
type: Concept
description: European Monitoring and Evaluation Programme
notation: EMEP

OS-LDEO
type: Concept
description: NA
notation: OSLDEO

ARGO EQ. IFM2
type: Concept
description: ARGO EQ. IFM2
notation: argoEqIFM2

OS-UW
type: Concept
description: NA
notation: OSUW

CARIOCA
type: Concept
description: CARIOCA SOUTHERN OCEAN
notation: CARIOCA

Argo GO-BGC, WHOI
type: Concept
description: Woods Hole Oceanographic Institution Argo BGC program
notation: argoGOBGCWHOI

University of South Florida Glider Program
type: Concept
description: USF Glider Program is part of SECOORA monitoring program
notation: USFGlider

TAO PIRATA
type: Concept
description: Prediction and Research Moored Array in the Atlantic
notation: taoPirata

MPLNET
type: Concept
description: Micro-Pulse Lidar Network
notation: MPLNET

GLOSS MY
type: Concept
description: Global Sea Level Observing System Tide Gauges - Malaysia
notation: GLOSSMY

ARGO UK BIO
type: Concept
description: ARGO UK BIO
notation: argoUKBIO

CAPMoN
type: Concept
description: Canadian Air and Precipitation Monitoring Network
notation: CAPMoN

Argo WHOI-SODA eq.
type: Concept
description: Woods Hole Oceanographic Institution - Stratified Ocean Dynamics of the Arctic Argo equivalent programme
notation: ARGOWHOISODAEQ

GLOSS RU
type: Concept
description: Global Sea Level Observing System Tide Gauges - Russia
notation: GLOSSRU

CLN
type: Concept
description: The NOAA Cooperative Remote Sensing Science and Technology (CREST) Lidar network
notation: CLN

VOS-IS
type: Concept
description: NA
notation: VOSIS

VOS-AU
type: Concept
description: NA
notation: VOSAU

ITP-WHOI
type: Concept
description: NA
notation: ITPWHOI

VOS-NO
type: Concept
description: NA
notation: VOSNO

UK-MO FIXED
type: Concept
description: UK Metoffice Fixed station
notation: UKMOfixed

VOS-CO
type: Concept
description: Colombian contribution to the Voluntary Observing Ships (VOS) program
notation: VOSCO

ARGO EQ. NRIFS
type: Concept
description: ARGO EQ. NRIFS
notation: argoEqNRIFS

VOS-HK
type: Concept
description: NA
notation: VOSHK

GLOSS SG
type: Concept
description: Global Sea Level Observing System Tide Gauges - Sinagpore
notation: GLOSSSG

HCMR glider program
type: Concept
description: HCMR maintain the Cretan Line.
notation: HCMRGlider

ANTON(T)
type: Concept
description: Antarctic Observing Network upper-air station (TEMP)
notation: ANTONt

OS-OGS
type: Concept
description: NA
notation: OSOGS

VOS-ZA
type: Concept
description: NA
notation: VOSZA

SOCLIM
type: Concept
description: Southern Ocean Climate: Field studies with innovative tools
notation: soclim

GLOSS PE
type: Concept
description: Global Sea Level Observing System Tide Gauges - Peru
notation: GLOSSPE

ARGO EQ. ORI
type: Concept
description: ARGO EQ. ORI
notation: argoEqORI

E-SURFMAR-NOAA
type: Concept
description: NA
notation: eSurfmarNOAA

CORIOLIS-EGYPT
type: Concept
description: NA
notation: coriolisEqypt

DEKOSIM
type: Concept
description: DEKOSIM is an interdisciplinary research project funded by the Turkish Ministry of Development
notation: DEKOSIM

Great Lakes Observing System Glider Program
type: Concept
description: Great Lakes Observing System Glider Program
notation: GreatLakeGlider

SOOP-IFREMER-TSG
type: Concept
description: T/S underway data collection program from Ifremer operated TSG and similar instruments
notation: SOOPIFREMERTSG

IDAF
type: Concept
description: IGAC/DEBITS Africa
notation: IDAF

ARGO UW-UA EQ.
type: Concept
description: ARGO UW-UA EQ.
notation: argoUWUAEq

OS-GEOMAR
type: Concept
description: NA
notation: OSGEOMAR

ARGO EQ. BSH
type: Concept
description: ARGO EQ. BSH
notation: argoEqBSH

CORIOLIS-GOOD HOPE
type: Concept
description: NA
notation: coriolisGoodHope

ASAP-AWI
type: Concept
description: AWI ASAP program
notation: ASAPAWI

Argo PERU
type: Concept
description: Argo project - Peru
notation: ARGOPeru

OOI-MB
type: Concept
description: Station owned and maintained by Ocean Observatories Initiative, Buoy
notation: OOIMB

VOS-IN
type: Concept
description: NA
notation: VOSIN

ADD
type: Concept
description: Aircraft Derived Data (Mode-S/ADS-B)
notation: ADD

ARGO FINLAND
type: Concept
description: ARGO FINLAND
notation: argoFinland

NWS-NDBC-WB
type: Concept
description: NWS NDBC Wave buoy
notation: NWSNDBCWB

SPAIN-IEO-MB
type: Concept
description: Moored Buoys Managed by Spanish Institute of Oceanography of the Ministry of Science and Technology
notation: SpainIEOMB

OOI - Coastal Endurance Array
type: Concept
description: The OOI is funded by the National Science Foundation and is managed and coordinated by the OOI Program Management Office (PMO) at the Woods Hole Oceanographic Institution (WHOI) in Woods Hole, MA.
notation: OOIEnduranceGlider

ARGO UW-SOCCOM EQ.
type: Concept
description: ARGO UW-SOCCOM EQ.
notation: argoUWSoccomEq

IMOS coastal wave buoys
type: Concept
description: Australia Integrated Marine Observing System (IMOS) moored wave buoys
notation: IMOSCoastalWB

APL-UW
type: Concept
description: NA
notation: APLUW

MOCCA-NETH
type: Concept
description: Monitoring the Oceans and Climate Change with Argo - Netherlands
notation: MOCCANETH

Polar Glider
type: Concept
description: Polar Gliders in a glider program within the University of Gothenburg. It is led by Sebastiaan Swart and focuses on understanding the importance and variability of the upper ocean.
notation: PolarGlider

ICOS
type: Concept
description: Integrated Carbon Observation System, www.icos-cp.eu
notation: ICOS

CORIOLIS-BIOARGO
type: Concept
description: NA
notation: coriolisBioargo

E-SURFMAR
type: Concept
description: EUMETNET Composite Observing System (EUCOS)Surface Marine Programme
notation: eSurfmar

GLOSS VU
type: Concept
description: Global Sea Level Observing System Tide Gauges - Vanuatu
notation: GLOSSVU

Projeto Azul
type: Concept
description: Project Azul is a cooperation between SHELL Brazil, the Laboratory of Computational Methods in Engineering (LAMCE) COPPE / UFRJ's and PROOCEANO, a Brazilian oceanographic technology company.
notation: projetoAzul

VOS-SHIP-MASK
type: Concept
description: Program created for platforms transmitting under 'SHIP' GTS identifier
notation: VOSSHIPMASK

IMARPE Glider Program
type: Concept
description: IMARPE (Instituto del Mar del Perœ) glider program
notation: IMARPEglider

BOM DB
type: Concept
description: Bureau of Meteorology (BOM) Drifting Buoy program
notation: BOMDB

DBCP others
type: Concept
description: NA
notation: DBCPothers

ASAP-US
type: Concept
description: US ASAP program led by NOAA
notation: ASAPUS

VOS-EU
type: Concept
description: NA
notation: VOSEU

OS-IO-NTU
type: Concept
description: NA
notation: OSIONTU

ARGO DENMARK
type: Concept
description: ARGO DENMARK
notation: argoDenmark

Argo Morocco
type: Concept
description: Morocco Argo programme
notation: ARGOMorocco

EC DB
type: Concept
description: Canada Drifting Buoys
notation: ECDB

HZG glider program
type: Concept
description: Glider program operated by Helmholtz-Zentrum Geesthacht
notation: HZGGlider

University of Massachussetts Dartmouth Glider Program
type: Concept
description: Program created for the deployment operated by the University of Massachusetts Dartmouth not registered under any other observation program.
notation: UMasGlider

ARGO EQ. HNFRI
type: Concept
description: ARGO EQ. HNFRI
notation: argoEqHNFRI

AEROCAN
type: Concept
description: AEROCAN, federated to AERONET
notation: AEROCAN

GLOSCAL
type: Concept
description: GLOSCAL is a French Project sponsored by ESA, which aims to calibrate and validate sea surface salinity (SSS) measurements carried out by satellite (e.g. SMOS and Aquarius).
notation: GLOSCAL

Alter_Eco glider program
type: Concept
description: An Alternative Framework to Assess Marine Ecosystem Functioning in Shelf Seas
notation: AlterECOGlider

GLOSS JM
type: Concept
description: Global Sea Level Observing System Tide Gauges - Jamaica
notation: GLOSSJM

CORIOLIS-SPICE
type: Concept
description: NA
notation: coriolisSpice

OS-HAV
type: Concept
description: NA
notation: OSHAV

SHELL
type: Concept
description: SHELL Beaufort sea ice movement
notation: shell

HK-OBS-DB
type: Concept
description: Hong Kong Observatory Drifter Buoy
notation: HKOBSDB

ARGO SIO EQ. (OKMC)
type: Concept
description: ARGO SIO EQ. (OKMC)
notation: argoSIOEqOKMC

TAO RAMA US-INDIA
type: Concept
description: Research Moored Array for African-Asian-Australian Monsoon Analysis and Prediction
notation: taoRamaUSindia

OS-CNR
type: Concept
description: NA
notation: OSCNR

GAW Local
type: Concept
description: Local GAW station
notation: GAWlocal

OGS glider program
type: Concept
description: Istituto Nazionale di Oceanografia e di Geofisica Sperimentale glider program
notation: OGSGlider

GLOSS IE
type: Concept
description: Global Sea Level Observing System Tide Gauges - Ireland
notation: GLOSSIE

GLOSS NA
type: Concept
description: Global Sea Level Observing System Tide Gauges - Namibia
notation: GLOSSNA

Woods Hole Spray glider Program
type: Concept
description: Woods Hole Spray glider surveys of the Gulf Stream and other regions.
notation: WHOIGlider

Texas University Glider Program
type: Concept
description: Texas University Glider Program is part of GCOOS Regional Alliance. Gulf of Mexico regional component of the U.S. Integrated Ocean Observing System (IOOS).
notation: texasUniversityGlider

SHOA-TSU
type: Concept
description: Chilean Navy Hydrographic And Oceanographic Service Tsunameter buoys
notation: shoaTSU

DTINSU international
type: Concept
description: Sustained programme of non-repeated National and International deployment of the French Gliders Facility
notation: FranceGlider

ARGO IRELAND
type: Concept
description: ARGO IRELAND
notation: argoIreland

GLOSS CA
type: Concept
description: Global Sea Level Observing System Tide Gauges - Canada
notation: GLOSSCA

OS-USP
type: Concept
description: NA
notation: OSUSP

ARGO UK EQ.
type: Concept
description: ARGO UK EQ.
notation: argoUKEq

ARGO EQ. UM-OSU
type: Concept
description: ARGO EQ. UM-OSU
notation: argoEqUMOSU

AOML-MF DB
type: Concept
description: NA
notation: AOMLMFDB

ARGO UW-SPURS EQ.
type: Concept
description: ARGO UW-SPURS EQ.
notation: argoUWSpursEq

SIO-DB
type: Concept
description: Scripps Institution of Oceanography Drifter Buoy
notation: SIODB

RBSN(T)
type: Concept
description: Regional Basic Synoptic Network upper-air station (TEMP)
notation: RBSNt

CORIOLIS-FLOSTRAL
type: Concept
description: NA
notation: coriolisFlostral

GLOSS SN
type: Concept
description: Global Sea Level Observing System Tide Gauges - Senegal
notation: GLOSSSN

GLOSS KP
type: Concept
description: Global Sea Level Observing System Tide Gauges - North Korea
notation: GLOSSKP

Copernicus Climate Change Service-C3S
type: Concept
description: The Copernicus Climate Change Service (C3S) operated by the European Centre for Medium Range Weather Forecasts (ECMWF), on behalf of the European Union
notation: C3S

COLOMBIA-TSU
type: Concept
description: Colombia Tsunameter buoy
notation: colombiaTSU

GYROSCOPE
type: Concept
description: GyroScope project is aimed to develop a European component of a global in situ observing system of ocean variability in the North Atlantic, as a contribution to the Argo project.
notation: gyroscope

ARGO COSTA RICA
type: Concept
description: ARGO COSTA RICA
notation: argoCostaRica

GLOSS CR
type: Concept
description: Global Sea Level Observing System Tide Gauges - Costa Rica
notation: GLOSSCR

BP INC
type: Concept
description: NA
notation: BPINC

IPABUS
type: Concept
description: International Programme for Antarctic Buoys - US
notation: IPABUS

E-ASAP
type: Concept
description: Eumetnet - Automated Shipboard Aerological Program
notation: eASAP

CDIP
type: Concept
description: Coastal Data Information Program (CDIP)
notation: CDIP

GAW Regional
type: Concept
description: Regional GAW station
notation: GAWregional

ARGO CANADA
type: Concept
description: ARGO CANADA
notation: argoCanada

GLOSS UY
type: Concept
description: Global Sea Level Observing System Tide Gauges - Uruguay
notation: GLOSSUY

CLIMAT(CT)
type: Concept
description: Station for which monthly climatological means of both surface and upper- air elements are transmitted
notation: CLIMATct

GUAN
type: Concept
description: GCOS Upper-Air Network
notation: GUAN

SAWS DB
type: Concept
description: South African Weather Service Drifting Buoys programme
notation: SAWSDB

ARGO AWI
type: Concept
description: ARGO AWI
notation: argoAWI

ARGO GERMANY
type: Concept
description: ARGO GERMANY
notation: argoGermany

PETROBRAS
type: Concept
description: NA
notation: petrobras

Argo GO-BGC, SIO
type: Concept
description: SCRIPPS institute Argo BGC program
notation: argoGOBGCSIO

USACE
type: Concept
description: Owned and maintained by U.S. Army Corps of Engineers, data provided by Scripps Institution of Oceanography, WaveRider Buoy
notation: USACE

ARGO BRAZIL
type: Concept
description: ARGO BRAZIL
notation: argoBrazil

SOOP-FVP-RECOPESCA
type: Concept
description: A new example of participative approach to collect in-situ environmental and fisheries data using fisheries vessels of opportunity
notation: SOOPFPVRECOPESCA

Argo CANADA eq.
type: Concept
description: Canadian Argo equivalent program
notation: argoCanadaEq

Large Lakes Observatory Glider Program
type: Concept
description: Large Lakes Observatory Glider Program
notation: LargeLakeGlider

NDBC-CSI
type: Concept
description: NA
notation: NDBCCSI

GAW Global
type: Concept
description: Global GAW station
notation: GAWglobal

CEOAS glider program
type: Concept
description: College of Earth, Ocean, and Atmospheric Sciences glider program contribute to the CeNCOOS is the Central and Northern California Ocean Observing System.
notation: CEOASGlider

ARGO RUSSIA
type: Concept
description: ARGO RUSSIA
notation: argoRussia

OS-HAMBURG UNIVERSITY
type: Concept
description: NA
notation: OShamburgUniversity

Centennial Observing Stations
type: Concept
description: Long-term meteorological observations are unique sources of past information about atmospheric parameters, thus are references for climate variability and change assessments. To highlight this importance, WMO has a mechanism to recognize centennial observing stations. By so doing, the Organization promotes sustainable observational standards and best practices that facilitate the generation of high-quality time series data.
notation: centennialObservingstations

ARGO EQ. SAGE
type: Concept
description: ARGO EQ. SAGE
notation: argoEqSage

SOCIB-DB
type: Concept
description: Balearic Islands Coastal Observing and Forecasting System contribution to the Global Drifter Array
notation: SOCIBDB

GLOSS CM
type: Concept
description: Global Sea Level Observing System Tide Gauges - Cameroon
notation: GLOSSCM

AARI
type: Concept
description: Buoys managed by Arctic and Antarctic Research Institute, Russian Federation
notation: AARI

GLOSS PG
type: Concept
description: Global Sea Level Observing System Tide Gauges - Papua New Guinea
notation: GLOSSPG

JMA DB
type: Concept
description: JMA Drifting Buoy
notation: JMADB

Argo WHOI-Loop Current eq.
type: Concept
description: 'Woods Hole Oceanographic Institution - Loop Current, Gulf of Mexico Argo equivalent programme'
notation: ARGOWHOIloopcurrentEQ

METEO FRANCE MB
type: Concept
description: MF Drifters Atlantic and Indian Ocean
notation: MeteoFranceMB

Adriatic Sea Observatory
type: Concept
description: Repeated section in the Adriatic water transformation region
notation: ASOGlider

NDBC-USCG
type: Concept
description: NA
notation: NDBCUSCG

GLOSS EG
type: Concept
description: Global Sea Level Observing System Tide Gauges - Egypt
notation: GLOSSEG

OS-CSIRO
type: Concept
description: NA
notation: OSCSIRO

BULARGO
type: Concept
description: NA
notation: BULARGO

ARGO UK
type: Concept
description: ARGO UK
notation: argoUK

Argo UW-MBARI
type: Concept
description: University of Washington - Monterey Bay Aquarium Research Institute Argo programme
notation: ARGOUWMBARI

CORIOLIS-TRACK
type: Concept
description: NA
notation: coriolisTrack

SHADOZ
type: Concept
description: Southern Hemisphere ADditional Ozonesondes
notation: SHADOZ

NOC Liverpool Glider Program
type: Concept
description: NOC Liverpool Glider Program covers the glider deployments lead by NOC_L that are not part of a sustained program.
notation: NOCLGlider

CORIOLIS
type: Concept
description: CORIOLIS
notation: coriolis

IMPROVE
type: Concept
description: IMPROVE Optical Aerosol
notation: IMPROVE

DFO/University of Victoria Glider program
type: Concept
description: Glider program operated by University of Victoria in collaboration with DFO
notation: DFOUVicGlider

University of Connectuct Glider Program
type: Concept
description: Glider observation program led by university of Connecticut
notation: UConnecticutglider

VOS-AR
type: Concept
description: Argentina's contribution to the Voluntary Observing Ships (VOS) program
notation: VOSAR

VOS-NL
type: Concept
description: NA
notation: VOSNL

ADS-C
type: Concept
description: Automatic Data Surveillance (ICAO). These are transmitted at selected points of the flightpath.
notation: ADSC

E-SURFMAR GDP
type: Concept
description: Global Drifter Program drifters with E-SURFMAR barometer upgrades
notation: eSurfmarGDP

Argo GO-BGC, UW
type: Concept
description: Argo BGC program of UW
notation: argoGOBGCUW

DFO USVs
type: Concept
description: Unmanned/Autonomous Surface Vehicles by DFO, Canada
notation: DFOUSVs

GLOSS IL
type: Concept
description: Global Sea Level Observing System Tide Gauges - Israel
notation: GLOSSIL

GRUAN
type: Concept
description: GCOS Reference Upper-Air Network
notation: GRUAN

University of East Anglia Glider Program
type: Concept
description: Glider program operated by UEA. UEA operated all over the world in area of interest for their science.
notation: UEAGlider

VOS-CL
type: Concept
description: NA
notation: VOSCL

OS-IFREMER
type: Concept
description: NA
notation: OSIFREMER

VOS-3P
type: Concept
description: NA
notation: VOS3P

ARGO EQ. WHOI
type: Concept
description: ARGO EQ. WHOI
notation: argoEqWHOI

INTAROS french glider program
type: Concept
description: Glider deployment run by CNRS in the Fram Strait during INTAROS project
notation: INTAROSGlider

NDBC-MBARI
type: Concept
description: NA
notation: NDBCMBARI

Stony Brook Glider Program
type: Concept
description: SoMas Glider Program is part of the CARICOOS program
notation: StonyBrookGlider

ARGO GREECE
type: Concept
description: ARGO GREECE
notation: argoGreece

Alseamar scientific glider program
type: Concept
description: Open Glider program of the French Manufacturer Alseamar
notation: AlseamarGlider

FERHRI-TSU
type: Concept
description: Far Eastern Regional Hydrometeorological Research Institute Tsunameter Buoys
notation: FERHRITSU

ARGO NETHERLANDS
type: Concept
description: ARGO NETHERLANDS
notation: argoNetherlands

DFO DB
type: Concept
description: Department of Fisheries and Oceans Drifter Buoys
notation: DFODB

RBON-Pilot Project
type: Concept
description: Regional Basic Observing Network (pilot project)
notation: RBONpilot

Ceilometers
type: Concept
description: Elastic lidar (ceilometer) networks
notation: ceilometers

NIC-IABP
type: Concept
description: NA
notation: NICIABP

Non-affiliated
type: Concept
description: Observing elements that are not affiliated with WIGOS or any of the co-sponsored programs
notation: nonAffiliated

VOS-US
type: Concept
description: NA
notation: VOSUS

OS-WHOI/SIO/OSU
type: Concept
description: NA
notation: OSWHOI-SIO-OSU

ARGO AUSTRALIA EQ.
type: Concept
description: ARGO AUSTRALIA EQ.
notation: argoAustraliaEq

ARGO WHOI-MRV EQ.
type: Concept
description: ARGO WHOI-MRV EQ.
notation: argoWHOIMRVEq

GOS General
type: Concept
description: No affiliation to other GOS Surface networks
notation: GOSGeneral

MOCCA-IT
type: Concept
description: Monitoring the Oceans and Climate Change with Argo - Italy
notation: MOCCAIT

EARLINET
type: Concept
description: European Aerosol Research Lidar Network
notation: EARLINET

RBCN
type: Concept
description: Regional Basic Climatological Networks
notation: RBCN

IBPIO
type: Concept
description: International Buoy Programme for the Indian Ocean (IBPIO)
notation: IBPIO

OS-CNR-ISMAR
type: Concept
description: Moorings operated by Istituto di Scienze MARine (ISMAR), Consiglio Nazionale delle Ricerche (CNR), Italy
notation: OSCNRISMAR

GLOSS ES
type: Concept
description: Global Sea Level Observing System Tide Gauges - Spain
notation: GLOSSES

CORIOLIS-FLOPS
type: Concept
description: CORIOLIS project for FLOtteurs du Pacifique Sud-es
notation: coriolisFlops

ARGO UW
type: Concept
description: ARGO UW
notation: argoUW

SKYNET
type: Concept
description: Aerosol-cloud-radiation interaction in the atmosphere project
notation: skynet

ARGO EQ. AOML
type: Concept
description: ARGO EQ. AOML
notation: argoEqAOML

ARGO EQ. AWI
type: Concept
description: ARGO EQ. AWI
notation: argoEqAWI

GLOSS DK
type: Concept
description: Global Sea Level Observing System Tide Gauges - Denmark
notation: GLOSSDK

INOCAR-TSU
type: Concept
description: Instituto Oceanografico de la Armada Tsunameter buoys
notation: INOCARTSU

SPAIN-PDE MB
type: Concept
description: Puertos del EStado Spain Moored buoy
notation: spainPDEMB

E-SURFMAR-UK/FR MB
type: Concept
description: NA
notation: eSurfmarUKFRMB

OOI - Coastal and Global Scale Nodes
type: Concept
description: The Ocean Observatories Initiative is funded by the National Science Foundation and is managed and coordinated by the OOI Program Management Office (PMO) at the Woods Hole Oceanographic Institution (WHOI) in Woods Hole, MA.
notation: OOICGSNGlider

Korea Underwater Glider Observing Network
type: Concept
description: Korea Underwater Glider Observing Network
notation: KUGON

NAOS-FRANCE
type: Concept
description: Novel Argo Ocean Observing System (NOAS) France project
notation: NAOSfrance

NDBC-NOAA-NWS
type: Concept
description: NA
notation: NDBCNOAANWS

CIS-LiNet
type: Concept
description: Atmosphere aerosol and ozone monitoring in CIS regions through lidar stations network
notation: CIS-LiNet

ARGO MAURITIUS
type: Concept
description: ARGO MAURITIUS
notation: argoMauritius

GDPMF
type: Concept
description: Global Drifter Program drifters with Meteo-France barometer upgrades
notation: GDPMF

OS-BIOS
type: Concept
description: NA
notation: OSBIOS

Balearic Islands Observatory
type: Concept
description: SOCIB operational program is, covering the Eivissa channel (6 transects) and Mallorca channel (1 transect) from APR to MAY 2019, sampling physical and biogeochemical parameters (CTD, fluorescence and turbidity, and oxygen).
notation: SOCIBGlider

PACIOOS
type: Concept
description: Pacific Islands Ocean Observing System Stations
notation: pacIOOS

OS-IO-WARNEMUENDE
type: Concept
description: NA
notation: OSIOwarnemuende

ARGO EQ. UHH
type: Concept
description: ARGO EQ. UHH
notation: argoEqUHH

GLOSS KR
type: Concept
description: Global Sea Level Observing System Tide Gauges - South Korea
notation: GLOSSKR

ARGO SOUTH AFRICA
type: Concept
description: ARGO SOUTH AFRICA
notation: argoSouthAfrica

NERACOOS-MB
type: Concept
description: Owned and maintained by Woods Hole Group/NERACOOS, Data provided by Scripps Institution of Oceanography
notation: NERACOOSMB

OS-SOA
type: Concept
description: NA
notation: OSSOA

BSH-MB
type: Concept
description: NA
notation: BSHMB

OS-NOC
type: Concept
description: NA
notation: OSNOC

Real-Time Aquatic Ecosystem Observation Network Glider program
type: Concept
description: Canadian contribution of the great lake observation using gliders
notation: RAEONGlider

ASAP-JP
type: Concept
description: Japanese ASAP program
notation: ASAPJP

OS-OCEANOR
type: Concept
description: Moorings operated by OCEANOR, Greece
notation: OSOCEANOR

ARGO EQ. ESP-OMZ
type: Concept
description: ARGO EQ. ESP-OMZ
notation: argoEqESPOMZ

Overturning in the Subpolar North Atlantic Program
type: Concept
description: Overturning in the Subpolar North Atlantic Program (OSNAP) is an international program designed to provide a continuous record of the full-water column, trans-basin fluxes of heat, mass and freshwater in the subpolar North Atlantic.
notation: OSNAPGlider

Cyprus Coastal Ocean Forecasting and Observing System
type: Concept
description: Sub-regional forecasting and observing system in the Eastern Mediterranean Levantine Basin, which covers the coastal and open sea areas of Cyprus, Cilician and Lattakian basins and the Eastern Levantine Base
notation: CYCOFOS

IABP US
type: Concept
description: Coordination/data management of the Intl Arctic Buoy program
notation: IABPUS

GAW-PFR
type: Concept
description: GAW Precision Filter Radiometer Network
notation: GAWPFR

SOOP-IRD-XBT
type: Concept
description: XBT program from IRD institute
notation: SOOPIRDXBT

SBU-MB
type: Concept
description: Owned and maintained by Stony Brook University Buoy
notation: SBUMB

ARGO EQ. IRELAND
type: Concept
description: ARGO EQ. IRELAND
notation: argoEqIreland

OS-ROYAL NETHERLANDS INSTITUTE FOR SEA RESEARCH (NIOZ)
type: Concept
description: NA
notation: OSNIOZ

ARGO ECUADOR
type: Concept
description: ARGO ECUADOR
notation: argoEcuador

GLOSS GH
type: Concept
description: Global Sea Level Observing System Tide Gauges - Ghana
notation: GLOSSGH

Department of Fisheries and Oceans Canada Glider Program
type: Concept
description: The Department of Fisheries and Oceans Canada Glider Program
notation: DFOGlider

NWS-NDBC-MB
type: Concept
description: NWS NDBC Moored buoy
notation: NWSNDBCMB

BSH-DWD-MB
type: Concept
description: NA
notation: BSHDWDMB

CORIOLIS-CANOA
type: Concept
description: NA
notation: coriolisCanoa

ARGO CHILE
type: Concept
description: ARGO CHILE
notation: argoChile

ARGO UW EQ.
type: Concept
description: ARGO UW EQ.
notation: argoUWEq

FMI Glider Program
type: Concept
description: Glider program operated by the Finish Institute of Meteorology. FMI operate gliders in the Baltic Sea.
notation: FMIGlider

Argo UW-SOCCOM
type: Concept
description: University of Washington - Southern Ocean Carbon and Climate Observations and Modelling Argo programme
notation: ARGOUWSOCCOM

ARGO UW-MBARI EQ.
type: Concept
description: ARGO UW-MBARI EQ.
notation: argoUWMbariEq

PolarAOD
type: Concept
description: Polar Aerosol Optical Depth Measurement Network Project
notation: polarAOD

ITALY-OGS
type: Concept
description: NA
notation: italyOGS

CORIOLIS-FRONTALIS
type: Concept
description: NA
notation: coriolisFrontalis

GOMIX
type: Concept
description: GOMIX glider program lead by University of Texas
notation: GOMIX

NOAA Glider Hurricane Program
type: Concept
description: NOAA Glider Hurricane Program aims at improving hurricane forecasting by assimilating observations from gliders situated in the passage of a a hurricane in the coastal seas of US.
notation: HurricaneGlider

OS-JMA/JAMSTEC
type: Concept
description: Moorings Operated by JMA-JAMSTEC
notation: OSJMAJAMSTEC

Peru-MB
type: Concept
description: Moored Buoys deployed by SENAMHI-Peru
notation: peruMB

CORIOLIS-REMOCEAN
type: Concept
description: NA
notation: coriolisRemocean

Argo GOM-BOEM eq.
type: Concept
description: Gulf of Mexico US Argo research program
notation: argoGOMBoemEq

CARICOOS
type: Concept
description: CarICOOS is the observing arm of the Caribbean Regional Association for Integrated Coastal Ocean Observing (CaRA)
notation: CARICOOS

GLOSS IS
type: Concept
description: Global Sea Level Observing System Tide Gauges - Iceland
notation: GLOSSIS

ASAP-MPI
type: Concept
description: ASAP on MPI operated RVs like German RV Sonne
notation: ASAPMPI

ODYSSEA H2020 Glider program
type: Concept
description: ODYSSEA developed, operate and demonstrate an interoperable and cost-effective platform that fully integrates networks of observing and forecasting systems across the Mediterranean basin, addressing both the open sea and the coastal zone. ODYSSEA program started in 2018 and finished in 2021.
notation: ODYSSEAGlider

GLOSS AU
type: Concept
description: Global Sea Level Observing System Tide Gauges - Australia
notation: GLOSSAU

GLOSS NO
type: Concept
description: Global Sea Level Observing System Tide Gauges - Norway
notation: GLOSSNO

REFINE
type: Concept
description: Robots Explore plankton-driven Fluxes in the marine twIlight zoNE - Argo
notation: REFINE

Argo UW-TPOS eq.
type: Concept
description: University of Washington - Tropical Pacific Observing System Argo equivalent programme
notation: ARGOUWTPOSEQ

Coastal Observing System for Northern and Arctic Seas
type: Concept
description: German multi-platform Observatory of the Northern and Arctic Sea
notation: COSYNA

GLOSS CO
type: Concept
description: Global Sea Level Observing System Tide Gauges - Colombia
notation: GLOSSCO

SOCIB-GDP
type: Concept
description: Barometer upgraded drifting buoys managed by the Balearic Islands Coastal Observing and Forecasting System (SOCIB), Spain, supported by GDP/NOAA
notation: SOCIBGDP

Argo SIO eq. (SBE61NOPP)
type: Concept
description: NOPP Deep Argo pilot
notation: argoSIOEqSBE61NOPP

TAMDAR
type: Concept
description: Tropospheric Aircraft Meteorological Data Relay (Commercial/Panasonic). Not currently open to GTS, contract with Panasonic and airline and/or NMHS
notation: TAMDAR

AtlantOS_H2020
type: Concept
description: Atlantic Ocean Observing System Horizon 2020 Argo project
notation: AtlantOSH2020

GLOSS MG
type: Concept
description: Global Sea Level Observing System Tide Gauges - Madagascar
notation: GLOSSMG

GLOSS ZA
type: Concept
description: Global Sea Level Observing System Tide Gauges - South Africa
notation: GLOSSZA

OS-AWI
type: Concept
description: AWI OceanSITES program
notation: OSAWI

OS-ICCM - ACIISI - GOBIERNO DE CANARIAS
type: Concept
description: NA
notation: OSICCMCanarias

University of Delaware Glider Program
type: Concept
description: University of Delaware glider program with the operational support of the Rutgers university collab Ocean Observation Lab.
notation: Udelawareglider

US-CG DB
type: Concept
description: USCG Drift Buoys
notation: USCGDB

VOS-DE
type: Concept
description: NA
notation: VOSDE

OS-UTokyo
type: Concept
description: Cabled sites operated by Tokyo University
notation: OSUTokyo

NORWAY-IMR
type: Concept
description: Institute of Marine Research Drifting Buoy Program
notation: NorwayIMR

MOCCA-GER
type: Concept
description: Monitoring the Oceans and Climate Change with Argo - Germany
notation: MOCCAGER

ACTRIS
type: Concept
description: Aerosol, Clouds and Trace Gases Research Infrastructure, www.actris.eu
notation: ACTRIS

IABP CANADA
type: Concept
description: ICE FLOE DRIFT
notation: IABPcanada

Lightning detection system
type: Concept
description: Surface-based lightning detection system
notation: lightningDetection

GLOSS MX
type: Concept
description: Global Sea Level Observing System Tide Gauges - Mexico
notation: GLOSSMX

OS-NOAA
type: Concept
description: Moorings operated generically by NOAA
notation: OSNOAA

Argo NIMS/KMA
type: Concept
description: National Institute of Meteorological Science/Korean Meteorological Administration Argo programme
notation: ARGONIMSKMA

OS-MSS
type: Concept
description: Shetland-branch monitoring in the Faroe-Shetland Channel, contributing to the Greenland-Scotland Ridge Transport Mooring Array within AtlantOS and the THOR, NACLIM and Blue-Action projects.
notation: OSMSS

VOS-IR
type: Concept
description: Islamic Republic of Iran contribution to the Voluntary Observing Ships (VOS) program
notation: VOSIR

ARGO LEBANON
type: Concept
description: ARGO LEBANON
notation: argoLebanon

ARGO EQ. NIPR
type: Concept
description: ARGO EQ. NIPR
notation: argoEqNIPR

Programme/network affiliation
type: Container
type: Collection
type: Register
description: Programme/network affiliation
modified: 2026-06-11T15:18:55.768Z
version info: 284
member: IMOS coastal wave buoys
member: Israeli National Monitoring
member: OS-ROYAL NETHERLANDS INSTITUTE FOR SEA RESEARCH (NIOZ)
member: UBO DB
member: DFO USVs
member: Texas University Glider Program
member: MEDARGO
member: OS-MBARI
member: ARGO KIOST
member: NWS-NDBC-WB
member: OS-HELLENIC CENTRE FOR MARINE RESEARCH
member: VOS-SE
member: GLOSS MU
member: WHYCOS
member: GLOSS OM
member: GLOSS CI
member: MOCCA-GER
member: NorGliders - Nansen Legacy
member: AMDAR
member: OS-ICCM - ACIISI - GOBIERNO DE CANARIAS
member: IL-DB
member: MERSEA
member: ARGO UK BIO
member: NWS-NDBC-MB
member: NorGliders - OVENS
member: GLOSS BD
member: ARGO WHOI
member: GLOSS NZ
member: GSRN
member: OSU DB
member: CORIOLIS-SPICE
member: GAW Local
member: BSH-DWD-MB
member: Global Drifter Program (GDP)
member: BOM DB
member: GLOSS RU
member: E-SURFMAR-IRISH IMI
member: CORIOLIS-EGYPT
member: ARGO PMEL
member: SHELL
member: Challenger
member: ARGO EQ. POMME
member: CLN
member: VOS-DK
member: VOS-HK
member: VOS-IR
member: AOML-E-SURFMAR
member: OS-SIO
member: GLOSS PA
member: OS-MBL
member: E-ASAP
member: CORIOLIS-FLOPS
member: NDBC-BP
member: CORIOLIS-EGEE
member: GOMIX
member: OS-BAS
member: Argo PERU
member: BSH-MB
member: ARGO AUSTRALIA EQ.
member: IABP-EC
member: GREECE MB
member: CORIOLIS-PREVIMER
member: AARI-USIABP
member: CDIP
member: JMA-TSU
member: CORIOLIS
member: Cyprus Coastal Ocean Forecasting and Observing System
member: EARLINET
member: INCOIS-TSU
member: SIO-DB
member: VOS-CO
member: UK-MO MB
member: STRATUS

GLOSS IN
type: Concept
description: Global Sea Level Observing System Tide Gauges - India
notation: GLOSSIN

UBO DB
type: Concept
description: Drifters funded by UBO (University of Western Brittany) and CNES.
notation: UBODB

OS-NOAA/PMEL
type: Concept
description: NA
notation: OSNOAA-PMEL

INCOIS-TSU
type: Concept
description: Indian National Centre for Ocean Information Services Tsunameter buoys
notation: INCOISTSU

NZ-TSU
type: Concept
description: GNS Science is a New Zealand Crown Research Institute
notation: NZTSU

ANTON(S)
type: Concept
description: Antarctic Observing Network surface station
notation: ANTONs

OS-ICELAND
type: Concept
description: OceanSITES operated by Iceland
notation: OSIceland

IL-MB
type: Concept
description: Moored buoys by Israel
notation: ILMB

CANDHIS
type: Concept
description: CANDHIS Wave buoys (CETMEF/Meteo France - (Centre d'Archivage National de Données de Houle In-Situ))
notation: CANDHIS

UK-MO LV
type: Concept
description: UK Metoffice Light Vessel
notation: UKMOLV

OS-CENTRE D'OCEANOLOGIE DE MARSEILLE
type: Concept
description: NA
notation: OSCOM

Virginia Institute of Marine Science Glider Program
type: Concept
description: Glider deployment operated by VIMS with observation program.
notation: VIMGlider

VOS-GB
type: Concept
description: NA
notation: VOSGB

Mediterranean Ocean Observing System for the Environment
type: Concept
description: Mediterranean Ocean Observing System for the Environment
notation: MOOSEnvironment

NorGlider - NorEMSO
type: Concept
description: Norwegian Glider program around EMSO sites
notation: NorEMSOGlider

OS-KIOST
type: Concept
description: NA
notation: OSKIOST

Scientific NATO glider experiment
type: Concept
description: Sustained gliders scientific experiments from NATO
notation: NATOGlider

AGAGE
type: Concept
description: AGAGE/SOGE/NIES
notation: AGAGE

ARGO EQ. FSU
type: Concept
description: ARGO EQ. FSU
notation: argoEqFSU

OS-INSTITUTE OF MARINE RESEARCH
type: Concept
description: NA
notation: OSIMR

NOAA Ocean Acidification Program
type: Concept
description: NOAA's Ocean Acidification Program - Gliders
notation: NOAAOAPglider

VOS-MAERSK
type: Concept
description: Program for Voluntary Observing Ships (VOS) data gathered by Maersk-owned systems.
notation: VOSMAERSK

Whale Glider Program
type: Concept
description: Whale Glider program in the Chukchi Sea.
notation: WhaleGlider

CryoNet
type: Concept
description: NA
notation: CryoNet

ITALY DB
type: Concept
description: Italian Drifting Buoys (EXPARGOS)
notation: italyDB

Marine Autonomous and Robotic Systems
type: Concept
description: UK sustained program for Autonomous Underwater Vehicles
notation: MARSGlider

OS-MNR
type: Concept
description: OceanSITES operated by Ministry of Natural Resources, China
notation: OSMNR

CW3E-CDWR
type: Concept
description: Center for Western Weather and Water Extremes - California Department of Water Resources
notation: CW3ECDWR

Israeli National Monitoring
type: Concept
description: 3 SeaExplorer gliders purchased and operated under consortium agreement between the four institutes.
notation: IsraelGlider

GLOSS OM
type: Concept
description: Global Sea Level Observing System Tide Gauges - Oman
notation: GLOSSOM

UK-MO DB
type: Concept
description: UK MetOffice Iridium Drifters
notation: UKMODB

Challenger
type: Concept
description: The Silbo Challenger mission is a partnership between industry and academia.
notation: Challenger

GLOSS LK
type: Concept
description: Global Sea Level Observing System Tide Gauges - Sri Lanka
notation: GLOSSLK

GLOSS YE
type: Concept
description: Global Sea Level Observing System Tide Gauges - Yemen
notation: GLOSSYE

BSRN
type: Concept
description: Baseline Surface Radiation Network
notation: BSRN

VOS-SE
type: Concept
description: NA
notation: VOSSE

ITP-DAMOCLES
type: Concept
description: NA
notation: ITPdamocles

German AOD network
type: Concept
description: German Aerosol Optical Depth Network
notation: germanAODnetwork

UCSD-SCRIPPS
type: Concept
description: SIO/CICESE Sea of Cortez Drifters
notation: UCSDscripps

OS-KNMI
type: Concept
description: Moorings operated by ROYAL NETHERLANDS METEOROLOGICAL INSTITUTE (KNMI), the Netherlands
notation: OSKNMI

EC-IABP
type: Concept
description: International Arctic Buoy Program
notation: ECIABP

US NAVY glider program
type: Concept
description: Glider program operated by NAVOCANO (Oceanographic component of the US navy).
notation: NavoceanGlider

JAMSTECDB
type: Concept
description: Japan Agency for Marine-Earth Science and Technology Drifting Buoy
notation: JAMSTECDB

University of Main Glider Program
type: Concept
description: Glider program run by University of Main
notation: Umaineglider

GLOSS TZ
type: Concept
description: Global Sea Level Observing System Tide Gauges - Tanzania
notation: GLOSSTZ

VOS-NZ
type: Concept
description: NA
notation: VOSNZ

NSF Long Term Ecological Research
type: Concept
description: The Long Term Ecological Research (LTER) program in Antarctica.
notation: LTERGlider

GTOS
type: Concept
description: Global Terrestrial Observing System
notation: GTOS

GO-SHIP
type: Concept
description: Global Ocean Ship-Based Hydrographic Investigations Programme
notation: GOship

ADNet
type: Concept
description: AD-Net Asian Dust and Lidar Observation Network
notation: ADNet

SKIO Glider Program
type: Concept
description: SKIO Glider Program is part of SECOORA's observatories to observe, understand, and increase awareness of our coastal ocean; promoting knowledge, economic and environmental health through strong regional partnerships.
notation: SKIOGlider

MOCCA-POL
type: Concept
description: Monitoring the Oceans and Climate Change with Argo - Poland
notation: MOCCAPOL

ARGO SAUDI ARABIA
type: Concept
description: ARGO SAUDI ARABIA
notation: argoSaudiArabia

ARGO EQ. IFM
type: Concept
description: ARGO EQ. IFM
notation: argoEqIFM

TAO TRITON
type: Concept
description: Triton buoy network
notation: taoTriton

NEW ZEALAND DB
type: Concept
description: NA
notation: NewZealandDB

OS-IEO
type: Concept
description: OceanSITES operated by IEO, Spain
notation: OSIEO

unknown
type: Concept
description: The affiliation/programme is unknown.
notation: unknown

VOS-JP
type: Concept
description: NA
notation: VOSJP

GCW affiliated station
type: Concept
description: A station of an GCW affiliated network measuring at least one cryospheric variable, contributing to GCW in addition to CryoNet and GCW contributing stations.
notation: GCWaffiliated

VOS-TH
type: Concept
description: Thai VOS program
notation: VOSTH

UW-URI Glider Program
type: Concept
description: Glider program lead by UW in cooperation with University of Rhode Island.
notation: UWURIglider

AERONET
type: Concept
description: AErosol RObotic NETwork
notation: AERONET

OS-HELLENIC CENTRE FOR MARINE RESEARCH
type: Concept
description: NA
notation: OSHCMR

SAS-DB
type: Concept
description: Voluntary buoys deployed by Sailing for Science
notation: SASDB

GLOSS ID
type: Concept
description: Global Sea Level Observing System Tide Gauges - Indonesia
notation: GLOSSID

SOOP-FVP-BDC
type: Concept
description: SOOP-FVP-Beering Data Collective. Collaborative data collection as a service, using S/T probes on fishing equipment
notation: SOOPFVPBDC

Macaronesian Marine and Maritime Observation Network
type: Concept
description: Repeated Gliders deployments across the Macaronesian region
notation: PLOCANGlider

Argo Sweden
type: Concept
description: Swedish Argo program
notation: argoSweden

ARGO CHINA
type: Concept
description: ARGO CHINA
notation: argoChina

BOM MB
type: Concept
description: Bureau of Meteorology (BOM) Moored Buoy
notation: BOMMB

ARGO TWR ENGINEERING
type: Concept
description: ARGO TWR ENGINEERING
notation: argoTWREng

RBON
type: Concept
description: Regional Basic Observing Network
notation: RBON

COPERNICUS-HRSST-FRM
type: Concept
description: COPERNICUS High Resolution SST Framework
notation: copernicusHRSSTFRM

Univ las Palmas glider program
type: Concept
description: Glider program of SITMA-ULPGC
notation: UnivLasPalmasGlider

RBSN(S)
type: Concept
description: Regional Basic Synoptic Network surface station (SYNOP)
notation: RBSNs

EC MB
type: Concept
description: Canadian Moored Buoy Programme (MSC)
notation: ECMB

RBSN(SP)
type: Concept
description: NA
notation: RBSNsp

IABP-EC
type: Concept
description: NA
notation: IABPEC

GERMANY MB
type: Concept
description: KIEL GEK BUOY
notation: germanyMB

AOML Glider Program
type: Concept
description: AOML Glider program is part of the CARICOOS Network
notation: AOMLGlider

GALION
type: Concept
description: GAW Aerosol Lidar Observation Network
notation: GALION

GLOSS PK
type: Concept
description: Global Sea Level Observing System Tide Gauges - Pakistan
notation: GLOSSPK

OS-IRD
type: Concept
description: NA
notation: OSIRD

OS-NERSC
type: Concept
description: Long time series moorings by Nansen Environmental and Remote Sensing Center
notation: OSNERSC

SOOP-IRD-TSG
type: Concept
description: T/S underway data collection program from IRD operated TSG and similar instruments
notation: SOOPIRDTSG

BioArgo UMaine
type: Concept
description: BGC Argo contribution from University of Maine
notation: bioargoUMaine

U.S. Antarctic Marine Living Resources Program
type: Concept
description: U.S. Antarctic Marine Living Resources glider program
notation: USAMLRPGlider

ARGO ITALY
type: Concept
description: ARGO ITALY
notation: argoItaly

ARGO NIMR/KMA
type: Concept
description: ARGO NIMR/KMA
notation: argoMIMRKMA

OS-IMARPE
type: Concept
description: NA
notation: OSIMARPE

GNSS radio-occultation system
type: Concept
description: NA
notation: GNSSradioOccultation

ARGO EQ. UH
type: Concept
description: ARGO EQ. UH
notation: argoEqUH

E-SURFMAR-UK MB
type: Concept
description: UKMO moored buoy programme
notation: eSurfmarUKMB

ARGO EQ. NAVOCEANO
type: Concept
description: ARGO EQ. NAVOCEANO
notation: argoEqNavoceano

CORIOLIS-REMOCEAN EQ.
type: Concept
description: NA
notation: coriolisRemoceanEq

GLOSS MZ
type: Concept
description: Global Sea Level Observing System Tide Gauges - Mozambique
notation: GLOSSMZ

OS-SAM
type: Concept
description: Southwest Atlantic MOC
notation: OSSAM

ARGO EQ. NDBC
type: Concept
description: ARGO EQ. NDBC
notation: argoEqNDBC

Scripps Glider Program
type: Concept
description: The Scripps Glider Program is part of the Southern California Coastal Ocean Observing System (SCCOOS) is one of eleven regions that contributes to the national U.S. Integrated Ocean Observing System (IOOS).
notation: ScrippsGlider

Global Ocean Monitoring and Observing Program - Glider
type: Concept
description: GOMO provide and support high quality global ocean observations and research to improve our scientific understanding and inform society about the ocean's role in environmental change. GOMO glider is the glider component of GOMO.
notation: GOMOGlider

NOAA-CBIBS
type: Concept
description: The National Oceanic and Atmospheric Administration's (NOAA) Chesapeake Bay Interpretive Buoy System (CBIBS) is a network of observing platforms (buoys) that collect meteorological, oceanographic, and water-quality data and relay that information using wireless technology to a variety of users.
notation: NOAACBIBS

VOS-FR
type: Concept
description: NA
notation: VOSFR

CORIOLIS-PREVIMER
type: Concept
description: NA
notation: coriolisPrevimer

OS-DFO
type: Concept
description: NA
notation: OSDFO

SCRIPPS
type: Concept
description: NA
notation: scripps

GLOSS AR
type: Concept
description: Global Sea Level Observing System Tide Gauges - Argentina
notation: GLOSSAR

CLIMAT(C)
type: Concept
description: Station for which monthly climatological means of surface elements are transmitted
notation: CLIMATc

NorGliders - ProVoLo
type: Concept
description: ProVoLo glider program operated by UiB
notation: ProVoLoGlider

GLOSS CL
type: Concept
description: Global Sea Level Observing System Tide Gauges - Chile
notation: GLOSSCL

MBARI glider program
type: Concept
description: MBARI and Naval Postgraduate School glider program
notation: MBARIGlider

ARGO EQ. PMEL
type: Concept
description: ARGO EQ. PMEL
notation: argoEqPMEL

TAMU-MB
type: Concept
description: Developed and maintained by Texas A&M University, Funding provided by the Texas General Land Office's Oil Spill Prevention & Response Program
notation: TAMUMB

GREECE MB
type: Concept
description: Moored buoys in the Greek Poseiden Network
notation: greeceMB

IL-DB
type: Concept
description: Drifting buoy by Israel
notation: ILBD

RUCOOL - Collaborative Reasearch
type: Concept
description: This project integrated a deep rated version of the Ion Sensitive Field Effect Transistor (ISFET)-based pH sensor, the Deep ISFET pH, into a Slocum Webb G2 glider.
notation: RUCOOLColResGlider

OS-KORS Pilot
type: Concept
description: Korean Ocean Research Stations (KORS), coastal pilot sites operated jointly by Korea Hydrographic and Oceanographic Agency (KHOA)and Korea Institute of Ocean Science and Technology (KIOST), Republic of Korea
notation: OSKORSPilot

SCALE glider program
type: Concept
description: Glider program operated by CSIR in the Antarctic/Southern Atlantic.
notation: SCALE

GLOSS BD
type: Concept
description: Global Sea Level Observing System Tide Gauges - Bangladesh
notation: GLOSSBD

CLIMAT(T)
type: Concept
description: Station for which monthly climatological means of upper-air elements are transmitted
notation: CLIMATt

RBSN
type: Concept
description: GOS Regional Basic Synoptic Networks
notation: RBSN

AWI-DB
type: Concept
description: Alfred Wagner Institute Drifter Buoy program
notation: AWIDB

VOS-MY
type: Concept
description: NA
notation: VOSMY

VOS-RU
type: Concept
description: NA
notation: VOSRU

OS-NOAA/NDBC
type: Concept
description: Moorings operated by NDBC
notation: OSNOAANDBC

SAILDRONE
type: Concept
description: Autonomous Surface Vehicles deployed by NOAA as pilot
notation: saildrone

GLOSS US
type: Concept
description: Global Sea Level Observing System Tide Gauges - United states of America
notation: GLOSSUS

PORTUGAL-MB
type: Concept
description: Portugal - Instituto Hidrografico (IH)
notation: PortugalMB

GLOSS MU
type: Concept
description: Global Sea Level Observing System Tide Gauges - Mauritius
notation: GLOSSMU

PHOTONS
type: Concept
description: PHOTONS, federated to AERONET
notation: PHOTONS

OS-UN_MIAMI
type: Concept
description: NA
notation: OSUNmiami

ARGO UW-APL EQ.
type: Concept
description: ARGO UW-APL EQ.
notation: argoUWAplEq

GSN
type: Concept
description: GCOS Surface Network
notation: GSN

ARGO EQ. TSK
type: Concept
description: ARGO EQ. TSK
notation: argoEqTSK

NDWC-TSU
type: Concept
description: National Disaster Warning Center Tsunameter buoys
notation: NDWCTSU

MARLIN-DB
type: Concept
description: NA
notation: marlinDB

GCW Contributing station
type: Concept
description: A GCW station which provides useful measurements of the cryosphere but does not meet all requirements for a CryoNet Station.
notation: GCWcontributing

ARGO JMA
type: Concept
description: ARGO JMA
notation: argoJMA

GLOSS VE
type: Concept
description: Global Sea Level Observing System Tide Gauges - Venezuela
notation: GLOSSVE

GLOSS NG
type: Concept
description: Global Sea Level Observing System Tide Gauges - Nigeria
notation: GLOSSNG

NDBC-TSU
type: Concept
description: NDBC Tsunameter buoys
notation: NDBCTSU

GLOSS SC
type: Concept
description: Global Sea Level Observing System Tide Gauges - Seychelles
notation: GLOSSSC

OS-UN_HAWAII_MANOA
type: Concept
description: NA
notation: OSUNhawaiiManoa

GLOSS KE
type: Concept
description: Global Sea Level Observing System Tide Gauges - Kenya
notation: GLOSSKE

OS-MBL
type: Concept
description: Moorings operated by Marine Biological Lab, USA
notation: OSMBL

Mid Atlantic Glider Initiative and Collaboration
type: Concept
description: Mid Atlantic Glider Initiative and Collaboration
notation: MAGIC

GLOSS CG
type: Concept
description: Global Sea Level Observing System Tide Gauges - Republic of the Congo
notation: GLOSSCG

ARGO IFM-GEOMAR
type: Concept
description: ARGO IFM-GEOMAR
notation: argoIFMGeomar

GLOSS PA
type: Concept
description: Global Sea Level Observing System Tide Gauges - Panama
notation: GLOSSPA

Argo FPAII-GMMC
type: Concept
description: Fondation Prince Albert II de Monaco - Groupe Mission Mercator Coriolis Argo programme
notation: ARGOFPAIIGMMC

SOOP-FVP-ODN
type: Concept
description: Fishing Vessel observation program led by Ocean Data Network
notation: SOOPFVPODN

Argo eq. HU
type: Concept
description: Hokkaido University contribution to Argo
notation: argoHUEq

SOOP-FVP-Vistools
type: Concept
description: ILVO fishing Vessel Observation Activities
notation: SOOPFVPVistools

Non-affiliated
type: Concept
description: Observing elements that are not affiliated with GAW or any of the co-sponsored programs
notation: GAWnonAffiliated

OS-NOAA/AOML
type: Concept
description: NA
notation: OSNOAA-AOML

NDBC-TABS
type: Concept
description: NA
notation: NDBCTABS

AFIRS
type: Concept
description: Automated Flight Information & Reporting System (Commercial/FLYHT). Not currently open to GTS, contract with Panasonic and airline and/or NMHS.
notation: AFIRS

TCCON
type: Concept
description: Total Carbon Column Observing Network
notation: TCCON

CORIOLIS-CONGAS
type: Concept
description: NA
notation: coriolisCongas

GLOSS HT
type: Concept
description: Global Sea Level Observing System Tide Gauges - Haiti
notation: GLOSSHT

ARGO EQ. VOCALS
type: Concept
description: ARGO EQ. VOCALS
notation: argoEqVocals

IABP-UW
type: Concept
description: Intl Arctic Buoy Program (IABP) University of Washington (UW)
notation: IABPUW

ARGO MEX-CO-US
type: Concept
description: ARGO MEX-CO-US
notation: argoMexCoUS

AOML-E-SURFMAR
type: Concept
description: NA
notation: AOMLeSurfmar

AOML
type: Concept
description: NA
notation: AOML

OS-EU-THOR
type: Concept
description: NA
notation: OSEUTHOR

GLOSS DJ
type: Concept
description: Global Sea Level Observing System Tide Gauges - Djibouti
notation: GLOSSDJ

NDBC-MB
type: Concept
description: NA
notation: NDBCMB

ARGO EQ. TNFRI
type: Concept
description: ARGO EQ. TNFRI
notation: argoEqTNFRI

STRATUS
type: Concept
description: Woodshole IO OceanSITES
notation: stratus

Argo Deep, CHINA
type: Concept
description: Deep Argo program led by QNLM (Qingdao pilot National Laboratory for Marine science and technology), China.
notation: argoDeepChina

Argo Portugal
type: Concept
description: Argo float deployment and scientific program in Portugal
notation: argoPortugal

GBON
type: Concept
description: Global Basic Observing Network
notation: GBON

ARGO EQ. POMME
type: Concept
description: ARGO EQ. POMME
notation: argoEqPomme

BSH-DWD-FIXED
type: Concept
description: NA
notation: BSHDWDfixed

SibRad
type: Concept
description: SibRad
notation: sibRad

SOOP-BOM
type: Concept
description: NA
notation: SOOPBOM

UNH-MB
type: Concept
description: Owned and maintained by the University of New Hampshire, Moored Buoy
notation: UNHMB

KMA MB
type: Concept
description: Korea Meteorological Department Moored Buoy programme
notation: KMAMB

NorGliders - SIOS
type: Concept
description: SIOS glider program operated by UiB
notation: SIOSGlider

OS-WHOI
type: Concept
description: NA
notation: OSWHOI

AOOS Gliders
type: Concept
description: AOOS glider is the glider program of the Alaska Ocean Observing System part of IOOS program.
notation: AOOSGlider

Rutgers Center for Ocean Observing Leadership Glider Program
type: Concept
description: The Rutgers University Center for Ocean Observing Leadership (RUCOOL) Glider program.
notation: RUCOOLGlider

CORIOLIS-FNOB-JCOMMOPS
type: Concept
description: CORIOLIS project under JCOMMOPS initiative, within a larger cooperation between the Fundacio Navegacio Oceanica Barcelona (FNOB)
notation: coriolisFNOBJCOMMOPS

OS-BAS
type: Concept
description: NA
notation: OSBAS

OS-JAMSTEC
type: Concept
description: NA
notation: OSJAMSTEC

ARGO CHINA SOA
type: Concept
description: ARGO CHINA SOA
notation: argoChinaSOA

GLOSS SO
type: Concept
description: Global Sea Level Observing System Tide Gauges - Somalia
notation: GLOSSSO

AMDAR
type: Concept
description: Aircraft Meteorological DAta Relay
notation: AMDAR

ARGO PMEL
type: Concept
description: ARGO PMEL
notation: argoPMEL

ARGO SIO
type: Concept
description: ARGO SIO
notation: argoSIO

ARGO EQ. FERHRI
type: Concept
description: ARGO EQ. FERHRI
notation: argoEqFERHRI

ARGO EQ. JAMSTEC
type: Concept
description: ARGO EQ. JAMSTEC
notation: argoEqJamstec

OS-DML
type: Concept
description: NA
notation: OSDML

NDBC-COE
type: Concept
description: NA
notation: NDBCCOE

NSF Northern Gulf of Alaska Long Term Ecological Research
type: Concept
description: NSF Northern Gulf of Alaska Long Term Ecological Research
notation: AlaskaLTERGlider

University of Gšteborg Glider Program
type: Concept
description: University of Gšteborg Glider Program
notation: Ugotebordglider

Global Drifter Program (GDP)
type: Concept
description: The Global Drifter Program (GDP) operated by SIO's Lagrangian Drifter Laboratory (LDL), funded by NOAA, maintaining a global array.
notation: GDP

CORIOLIS-PROSAT
type: Concept
description: NA
notation: coriolisProsat

Tallin University Glider Program
type: Concept
description: Estonian Glider program operated by Tallin University of Technology.
notation: TTUGlider

NDBC-NASA
type: Concept
description: NA
notation: NDBCNASA

VOS-IE
type: Concept
description: NA
notation: VOSIE

CNR Ismar Glider Program
type: Concept
description: Glider program operated by CNR ISMAR including repeated section between Sardinia and Balearic Island
notation: ISMARGlider

ARGO ARGENTINA
type: Concept
description: ARGO ARGENTINA
notation: argoArgentina

METEO FRANCE DB
type: Concept
description: MF Drifters Atlantic and Indian Ocean
notation: MeteoFranceDB

GLOSS DE
type: Concept
description: Global Sea Level Observing System Tide Gauges - Germany
notation: GLOSSDE

Argo GERMANY 2025
type: Concept
description: German Argo 2025
notation: argoGermany2025

NIWA Glider Program
type: Concept
description: Glider program operated by NIWA is New Zealand.
notation: NIWAGlider

VOS-CA
type: Concept
description: NA
notation: VOSCA

ARGO SPAIN
type: Concept
description: ARGO SPAIN
notation: argoSpain

GCW CryoNet station
type: Concept
description: A GCW station measuring at least one variable of one cryosphere component, and meeting a set of defined requirements.
notation: GCWCryoNet

CASTNET
type: Concept
description: Clean Air Status and Trends Network
notation: CASTNET

AIREP
type: Concept
description: Aircraft Report (Manual). These are transmitted by the aircraft when a weather event encountered e.g. severe turbulence or icing.
notation: AIREP

OS-NIO
type: Concept
description: NA
notation: OSNIO

ARGO EQ. JMA
type: Concept
description: ARGO EQ. JMA
notation: argoEqJMA

MOCCA-EU
type: Concept
description: Monitoring the Oceans and Climate Change with Argo - EU
notation: MOCCAEU

ARGO EQ. CHINA
type: Concept
description: ARGO EQ. CHINA
notation: argoEqChina

Irish sustained glider deployment
type: Concept
description: Irish deployment on sustained endurance line
notation: irishGlider

GLOSS IR
type: Concept
description: Global Sea Level Observing System Tide Gauges - Iran
notation: GLOSSIR

RBSN(P)
type: Concept
description: Regional Basic Synoptic Network upper-air station (PILOT)
notation: RBSNp

OS-NIWA
type: Concept
description: NA
notation: OSNIWA

ASAP-KR
type: Concept
description: Korean ASAP program
notation: ASAPKR

VOS-PL
type: Concept
description: Polish VOS program
notation: VOSPL

NorGliders - other
type: Concept
description: Norwegian national facility for ocean gliders (NorGliders) is running glider missions along repeated section in outstanding sites of interest are the Svinøy Section, the Lofoten Basin of the Norwegian Sea, the Mohn ridge, as well as the Iceland and Greenland Seas.
notation: NorwayGlider

NCSU Ocean Observing and Modeling Group Glider Program
type: Concept
description: Glider program of the NCSU (North Carolina State University) Ocean Observing and modelling group
notation: NCSUglider

GLOSS CN
type: Concept
description: Global Sea Level Observing System Tide Gauges - China
notation: GLOSSCN

ARGO BRAZIL NAVY
type: Concept
description: ARGO BRAZIL NAVY
notation: argoBrazilNavy

GLOSS PH
type: Concept
description: Global Sea Level Observing System Tide Gauges - Philippines
notation: GLOSSPH

OSU DB
type: Concept
description: Ice buoys operated by Oregon State University, USA, contributing to the International Arctic Buoy Progrmme.
notation: OSUDB

Wind Profilers
type: Concept
description: Wind profilers for upper-air wind observations
notation: windProfiler

BRAZIL PNBOIA-INPE
type: Concept
description: Programa Nacional de Boias (PNBOIA) is the brazilian contribution to the Global Ocean Observation System (GOOS). Instituto Nacional de Pesquisas Espacias (INPE)
notation: brazilPNBOIAINPE

TAO ATLAS
type: Concept
description: TAO Array of ATLAS buoys in the Equatorial Ocean
notation: taoAtlas

OS-CNRS
type: Concept
description: NA
notation: OSCNRS

AARI-USIABP
type: Concept
description: Collaborative buoys by Arctic and Antarctic Research Institute of Russian Federation and International Arctic Buoy Program of the USA
notation: AARIUSIABPDB

AOML Hurricane ALAMO Floats
type: Concept
description: Hurricane float programme
notation: AOMLHurricaneALAMOFloats

OS-NIOT
type: Concept
description: NA
notation: OSNIOT

MERSEA
type: Concept
description: NA
notation: MERSEA

GLOSS GB
type: Concept
description: Global Sea Level Observing System Tide Gauges - United Kingdom
notation: GLOSSGB

CORIOLIS-DRAKE
type: Concept
description: ARGO South West Atlantic
notation: coriolisDrake

INDIA-NIOT
type: Concept
description: Indian Ocean Observing Program
notation: indiaNIOT

OS-SAMS_DML
type: Concept
description: Moorings operated by SAMS, UK
notation: OSSAMSDML

NorGliders - Nansen Legacy
type: Concept
description: Nansen Legacy glider program Operated by NorGliders
notation: NansenLegacyGlider

Argo BGC, AOML
type: Concept
description: NOAA/AOML Argo BGC float program
notation: argoBGCAOML

SOSCEx glider program
type: Concept
description: The Southern Ocean Seasonal Cycle Experiment glider program.
notation: SOSCEX

US EPA Great Lakes National Program
type: Concept
description: US EPA Great Lakes National Glider Program.
notation: USEPAGLGlider